{"text_format":"3","workbook":"xlsx","n_sheets":3,"sheets":["Калькулятор","коэф.","Table 0 (2)"],"not_rendered":{"charts":1,"images":2,"macros":1,"defined_names":1},"read":"whole","date_system":"1900"}

{"sheet":"Калькулятор","index":0,"n_rows":32,"n_cols":9,"rows_kept":32,"merged":[[1,1,1,4],[1,5,1,9],[1,11,4,26],[4,5,6,5],[8,5,8,6],[12,5,12,6],[16,5,16,6],[23,5,23,6],[24,2,24,3],[28,2,28,3],[31,2,32,3],[31,5,31,6]]}
[]
[null,"Калькулятор"]
[]
[null,null,{"$f":"коэф.!B3","v":"Объем эмиссии"},{"v":3700000000,"d":"3,700,000,000 ₽"},null,{"$f":"коэф.!B9","v":"Текущая доходность ОФЗ"},null,{"$f":"VLOOKUP(D20/365,'Table 0 (2)'!$D$2:$E$15,2,TRUE)*100","v":10.25},"%"]
[null,null,{"$f":"коэф.!G3","v":"Укажите в рублях планируемый объем эмиссии"},null,null,{"$f":"коэф.!G9","v":"Укажите величину безрисковой ставки в зависимости от срока погашения (выгружается автоматически), %"}]
[]
[]
[null,null,{"$f":"коэф.!B4","v":"Объем выручки"},{"v":2215000000,"d":"2,215,000,000 ₽"},null,{"$f":"коэф.!B11","v":"Первый выпуск"},null,"Нет"]
[null,null,{"$f":"коэф.!G4","v":"Укажите в рублях объем выручки компании на конец года"},null,null,{"$f":"коэф.!G11","v":"Является ли планируемый выпуск первым для вашей компании?"}]
[]
[]
[null,null,{"$f":"коэф.!B6","v":"Регион эмитента"},"Москва",null,{"$f":"коэф.!B12","v":"Наличие put-оферты "},null,"Нет"]
[null,null,{"$f":"коэф.!G6","v":"Укажите регион эмиссии облигаций"},null,null,{"$f":"коэф.!G12","v":"Предусматривается ли put-опцион?"}]
[]
[]
[null,null,{"$f":"коэф.!B8","v":"Кредитный рейтинг"},"AA+",null,{"$f":"коэф.!B13","v":"Амортизируемость эмиссии"},null,"Да"]
[null,null,{"$f":"коэф.!G8","v":"Укажите кредитный рейтинг вашей компании"},null,null,{"$f":"коэф.!G13","v":"Является ли планируемый выпуск амортизируемым для вашей компании?"}]
[]
[]
[null,null,{"$f":"коэф.!B14","v":"Срок обращения"},1095]
[null,null,{"$f":"коэф.!G14","v":"Укажите в днях планируемый срок обращения облигаций"}]
[]
[]
[null,null,"Диапазон процентной ставки",null,null,{"$f":"IF(COUNTA(Калькулятор!D4,Калькулятор!D8,Калькулятор!D12,Калькулятор!D16,Калькулятор!H4,Калькулятор!H8,Калькулятор!H12,Калькулятор!H16)=8,\n(ROUND((коэф.!E2 + коэф.!E3*LN(Калькулятор!D4) + коэф.!E5*Калькулятор!D4/Калькулятор!D8 + коэф.!E7*VLOOKUP(Калькулятор!D12,коэф.!$D$34:$E$115,2,FALSE) + коэф.!E8*VLOOKUP(Калькулятор!D16,коэф.!$D$16:$E$32,2,FALSE) + коэф.!E9*Калькулятор!H4 + коэф.!E11*IF(Калькулятор!H8=\"Да\",1,0) + коэф.!E12*IF(Калькулятор!H12=\"Да\",1,0) + коэф.!E13*IF(Калькулятор!H16=\"Да\",1,0)),2)\n-0.5&\" – \"&ROUND((коэф.!E2 + коэф.!E3*LN(Калькулятор!D4) + коэф.!E5*Калькулятор!D4/Калькулятор!D8 + коэф.!E7*VLOOKUP(Калькулятор!D12,коэф.!$D$34:$E$115,2,FALSE) + коэф.!E8*VLOOKUP(Калькулятор!D16,коэф.!$D$16:$E$32,2,FALSE) + коэф.!E9*Калькулятор!H4 + коэф.!E11*IF(Калькулятор!H8=\"Да\",1,0) + коэф.!E12*IF(Калькулятор!H12=\"Да\",1,0) + коэф.!E13*IF(Калькулятор!H16=\"Да\",1,0)),2)\n+0.5&\"%\"),\"Заполните пустые ячейки\")","v":"9,4 – 10,4%"}]
[null,null,{"$f":"IF(F24=\"\",\"Введите значения в поля выше\",\"Ориентировочная процентная ставка для обозначенных параметров выпуска\")","v":"Ориентировочная процентная ставка для обозначенных параметров выпуска"}]
[]
[]
[null,null,"Расходы на размещение",null,null,{"v":3.5,"d":"3.50"},"%"]
[null,null,"Ориентировочная величина расходов на размещение относительно объема выпуска, %"]
[]
[]
[null,null,"Диапазон процентной ставки с учетом расходов на размещение",null,null,{"$f":"IF(COUNTA(Калькулятор!D4,Калькулятор!D8,Калькулятор!D12,Калькулятор!D16,Калькулятор!H4,Калькулятор!H8,Калькулятор!H12,Калькулятор!H16,D20,F28)=10,\n(ROUND((коэф.!E2 + коэф.!E3*LN(Калькулятор!D4) + коэф.!E5*Калькулятор!D4/Калькулятор!D8 + коэф.!E7*VLOOKUP(Калькулятор!D12,коэф.!$D$34:$E$115,2,FALSE) + коэф.!E8*VLOOKUP(Калькулятор!D16,коэф.!$D$16:$E$32,2,FALSE) + коэф.!E9*Калькулятор!H4 + коэф.!E11*IF(Калькулятор!H8=\"Да\",1,0) + коэф.!E12*IF(Калькулятор!H12=\"Да\",1,0) + коэф.!E13*IF(Калькулятор!H16=\"Да\",1,0)+((F28)*365/D20)),2)\n-0.5&\" – \"&ROUND((коэф.!E2 + коэф.!E3*LN(Калькулятор!D4) + коэф.!E5*Калькулятор!D4/Калькулятор!D8 + коэф.!E7*VLOOKUP(Калькулятор!D12,коэф.!$D$34:$E$115,2,FALSE) + коэф.!E8*VLOOKUP(Калькулятор!D16,коэф.!$D$16:$E$32,2,FALSE) + коэф.!E9*Калькулятор!H4 + коэф.!E11*IF(Калькулятор!H8=\"Да\",1,0) + коэф.!E12*IF(Калькулятор!H12=\"Да\",1,0) + коэф.!E13*IF(Калькулятор!H16=\"Да\",1,0)+((F28)*365/D20)),2)\n+0.5&\"%\"),\"Заполните пустые ячейки\")","v":"10,57 – 11,57%"}]

{"sheet":"коэф.","index":1,"n_rows":115,"n_cols":10,"rows_kept":115,"hidden":true,"merged":[[0,6,0,7],[0,8,0,9],[8,6,8,7],[15,0,31,0],[15,1,31,1],[27,5,27,6],[27,7,27,8],[33,0,114,0],[33,1,114,1]]}
["№","ТЕМА",null,"НАЗВАНИЕ КОЭФ-ТА","КОЭФ-Т","СОДЕРЖАНИЕ","РАСШИФРОВКА ТЕМЫ",null,"ВАРИАНТ ОТВЕТА "]
[0,null,null,"C ",{"v":10.96084,"d":"10.96"}]
[1,"Объем эмиссии","ln","LNEM ",{"v":-0.127353,"d":"-0.13"},"Пользователь вносит (в руб.)","Укажите в рублях планируемый объем эмиссии"]
[2,"Объем выручки",null,"-","-","Пользователь вносит (в руб.)","Укажите в рублях объем выручки компании на конец года"]
["1+2","Эмиссия/выручка ",null,"EM_INCOME ",{"v":0.012522,"d":"0.01"},"Расчетный показатель"]
[3,"Регион эмитента",null,"-","-","Пользователь выбирает","Укажите регион эмиссии облигаций"]
[3,"ВРП на душу","ln","LNVRPCAPITA  ",{"v":-0.255271,"d":"-0.26"},"Расчетный показатель"]
[4,"Кредитный рейтинг",null,"RATE ",{"v":-0.307087,"d":"-0.31"},"Пользователь выбирает","Укажите кредитный рейтинг вашей компании"]
[5,"Текущая доходность ОФЗ",null,"GOVPROFIT ",{"v":0.890042,"d":"0.89"},"Пользователь вносит (в %)","Укажите величину безрисковой ставки в зависимости от срока погашения (выгружается автоматически), %"]
[{"$nulls":6},"(доступна на сайте ЦБ РФ)"]
[6,"Первый выпуск",null,"FIRST ",{"v":0.348442,"d":"0.35"},"Пользователь выбирает (Да=1/Нет=0)","Является ли планируемый выпуск первым для вашей компании?",null,"Да","Нет"]
[7,"Наличие put-оферты ",null,"PUT  ",{"v":-0.206983,"d":"-0.21"},"Пользователь выбирает (Да=1/Нет=0)","Предусматривается ли put-опцион?",null,"Да","Нет"]
[8,"Амортизируемость эмиссии",null,"DEPR ",{"v":-0.955597,"d":"-0.96"},"Пользователь выбирает (Да=1/Нет=0)","Является ли планируемый выпуск амортизируемым для вашей компании?",null,"Да","Нет"]
[9,"Срок обращения",null,"-","-","Пользователь вносит (в днях)","Укажите в днях планируемый срок обращения облигаций"]
[]
[4,"Кредитный рейтинг",null,"AAA",10]
[{"$nulls":3},"AA+",9]
[{"$nulls":3},"AA",8]
[{"$nulls":3},"AA-",7]
[{"$nulls":3},"A+",6]
[{"$nulls":3},"A",5]
[{"$nulls":3},"A-",4]
[{"$nulls":3},"BBB+",3]
[{"$nulls":3},"BBB",2]
[{"$nulls":3},"BBB-",1]
[{"$nulls":3},"BB+",0]
[{"$nulls":3},"BB",0]
[{"$nulls":3},"BB-",0]
[{"$nulls":3},"B+",0]
[{"$nulls":3},"B",0]
[{"$nulls":3},"B-",0]
[{"$nulls":3},"Ниже В- или отсутствует",0]
[{"$nulls":3},1,2]
[3,"ВРП на душу",null,"Белгородская область",{"$f":"LN(F34)","v":{"v":13.472257707644639,"d":"13"}},{"v":709458.8019944297,"d":"709,458.80"}]
[{"$nulls":3},"Брянская область",{"$f":"LN(F35)","v":{"v":12.881294969570742,"d":"13"}},{"v":392893.93525191233,"d":"392,893.94"}]
[{"$nulls":3},"Владимирская область",{"$f":"LN(F36)","v":{"v":13.047834046431104,"d":"13"}},{"v":464090.12461484096,"d":"464,090.12"}]
[{"$nulls":3},"Воронежская область",{"v":13.104219303152487,"d":"13"},{"v":491009.7692177177,"d":"491,009.77"}]
[{"$nulls":3},"Ивановская область",{"v":12.5742039491487,"d":"13"},{"v":289006.3528834682,"d":"289,006.35"}]
[{"$nulls":3},"Калужская область",{"v":13.397863765054927,"d":"13"},{"v":658594.8077040327,"d":"658,594.81"}]
[{"$nulls":3},"Костромская область",{"v":12.806504079522762,"d":"13"},{"v":364581.0187968452,"d":"364,581.02"}]
[{"$nulls":3},"Курская область",{"v":13.20563469262989,"d":"13"},{"v":543418.3219394765,"d":"543,418.32"}]
[{"$nulls":3},"Липецкая область",{"v":13.223024383452872,"d":"13"},{"v":552950.842115493,"d":"552,950.84"}]
[{"$nulls":3},"Московская область",{"v":13.525130621113457,"d":"14"},{"v":747979.3286749534,"d":"747,979.33"}]
[{"$nulls":3},"Орловская область",{"v":12.91549000091592,"d":"13"},{"v":406561.30195435084,"d":"406,561.30"}]
[{"$nulls":3},"Рязанская область",{"v":13.006373260812158,"d":"13"},{"v":445242.01213537913,"d":"445,242.01"}]
[{"$nulls":3},"Смоленская область",{"v":12.972478326767535,"d":"13"},{"v":430403.4599727464,"d":"430,403.46"}]
[{"$nulls":3},"Тамбовская область",{"v":12.857151278527152,"d":"13"},{"v":383521.62185541005,"d":"383,521.62"}]
[{"$nulls":3},"Тверская область",{"v":13.009993444724108,"d":"13"},{"v":446856.7912397319,"d":"446,856.79"}]
[{"$nulls":3},"Тульская область",{"v":13.200541293338086,"d":"13"},{"v":540657.5123646959,"d":"540,657.51"}]
[{"$nulls":3},"Ярославская область",{"v":13.226445711146491,"d":"13"},{"v":554845.9081171743,"d":"554,845.91"}]
[{"$nulls":3},"Москва",{"v":14.418258840138732,"d":"14"},{"v":1827133.384599276,"d":"1,827,133.38"}]
[{"$nulls":3},"Республика Карелия",{"v":13.370274822210792,"d":"13"},{"v":640673.2286430931,"d":"640,673.23"}]
[{"$nulls":3},"Республика Коми",{"v":13.850682768613604,"d":"14"},{"v":1035798.0688994474,"d":"1,035,798.07"}]
[{"$nulls":3},"Архангельская область",{"v":13.734741353821855,"d":"14"},{"v":922406.5544914909,"d":"922,406.55"}]
[{"$nulls":3},"Вологодская область",{"v":13.357000229673853,"d":"13"},{"v":632224.7516899501,"d":"632,224.75"}]
[{"$nulls":3},"Калининградская область",{"v":13.28335648753216,"d":"13"},{"v":587338.4377062393,"d":"587,338.44"}]
[{"$nulls":3},"Ленинградская область",{"v":13.536456246789648,"d":"14"},{"v":756498.8157600156,"d":"756,498.82"}]
[{"$nulls":3},"Мурманская область",{"v":13.829814374011479,"d":"14"},{"v":1014406.6051312722,"d":"1,014,406.61"}]
[{"$nulls":3},"Новгородская область",{"v":13.102253767846012,"d":"13"},{"v":490045.6200255377,"d":"490,045.62"}]
[{"$nulls":3},"Псковская область",{"v":12.817119256413031,"d":"13"},{"v":368471.7245327154,"d":"368,471.72"}]
[{"$nulls":3},"Санкт-Петербург ",{"v":13.897158123567843,"d":"14"},{"v":1085073.3252706763,"d":"1,085,073.33"}]
[{"$nulls":3},"Республика Адыгея",{"v":12.740707919220924,"d":"13"},{"v":341365.12090233306,"d":"341,365.12"}]
[{"$nulls":3},"Республика Калмыкия",{"v":12.879454505203206,"d":"13"},{"v":392171.49298241554,"d":"392,171.49"}]
[{"$nulls":3},"Республика Крым",{"v":12.582523863669978,"d":"13"},{"v":291420.8914849071,"d":"291,420.89"}]
[{"$nulls":3},"Краснодарский край",{"v":13.09824081954626,"d":"13"},{"v":488083.03280213673,"d":"488,083.03"}]
[{"$nulls":3},"Астраханская область",{"v":13.64063384111016,"d":"14"},{"v":839560.5180511684,"d":"839,560.52"}]
[{"$nulls":3},"Волгоградская область",{"v":12.973306618307058,"d":"13"},{"v":430760.1072007737,"d":"430,760.11"}]
[{"$nulls":3},"Ростовская область",{"v":12.995682215574336,"d":"13"},{"v":440507.26444053196,"d":"440,507.26"}]
[{"$nulls":3},"г.Севастополь",{"v":12.88376331610277,"d":"13"},{"v":393864.9315190792,"d":"393,864.93"}]
[{"$nulls":3},"Республика Дагестан",{"v":12.439856716942913,"d":"12"},{"v":252674.33293889317,"d":"252,674.33"}]
[{"$nulls":3},"Республика Ингушетия",{"v":12.00852674092465,"d":"12"},{"v":164148.4927807842,"d":"164,148.49"}]
[{"$nulls":3},"Кабардино-Балкарская Республика",{"v":12.263801628673116,"d":"12"},{"v":211885.5667994727,"d":"211,885.57"}]
[{"$nulls":3},"Карачаево-Черкесская Республика",{"v":12.30249764867121,"d":"12"},{"v":220245.39789631154,"d":"220,245.40"}]
[{"$nulls":3},"Республика Северная Осетия-Алания",{"v":12.528818651728216,"d":"13"},{"v":276182.9125237104,"d":"276,182.91"}]
[{"$nulls":3},"Чеченская Республика",{"v":12.102928353342444,"d":"12"},{"v":180399.36259953975,"d":"180,399.36"}]
[{"$nulls":3},"Ставропольский край",{"v":12.696545630794931,"d":"13"},{"v":326617.69281809864,"d":"326,617.69"}]
[{"$nulls":3},"Республика Башкортостан",{"v":13.179520299441661,"d":"13"},{"v":529410.9749286161,"d":"529,410.97"}]
[{"$nulls":3},"Республика Марий Эл",{"v":12.735891914801382,"d":"13"},{"v":339725.0574178387,"d":"339,725.06"}]
[{"$nulls":3},"Республика Мордовия",{"v":12.836122952302693,"d":"13"},{"v":375541.0076337151,"d":"375,541.01"}]
[{"$nulls":3},"Республика Татарстан",{"v":13.683787096715143,"d":"14"},{"v":876583.3708350875,"d":"876,583.37"}]
[{"$nulls":3},"Удмуртская Республика",{"v":13.244914998583072,"d":"13"},{"v":565188.7349926893,"d":"565,188.73"}]
[{"$nulls":3},"Чувашская Республика",{"v":12.663340617690203,"d":"13"},{"v":315950.43142641825,"d":"315,950.43"}]
[{"$nulls":3},"Пермский край",{"v":13.444843522185547,"d":"13"},{"v":690273.7397575997,"d":"690,273.74"}]
[{"$nulls":3},"Кировская область",{"v":12.710215446053217,"d":"13"},{"v":331113.15238689113,"d":"331,113.15"}]
[{"$nulls":3},"Нижегородская область",{"v":13.298951238420955,"d":"13"},{"v":596569.6262910938,"d":"596,569.63"}]
[{"$nulls":3},"Оренбургская область",{"v":13.464083809895685,"d":"13"},{"v":703683.3942418455,"d":"703,683.39"}]
[{"$nulls":3},"Пензенская область",{"v":12.910886938603674,"d":"13"},{"v":404694.17549417797,"d":"404,694.18"}]
[{"$nulls":3},"Самарская область",{"v":13.329385476892647,"d":"13"},{"v":615004.8770332927,"d":"615,004.88"}]
[{"$nulls":3},"Саратовская область",{"v":12.830687311076835,"d":"13"},{"v":373505.23931614927,"d":"373,505.24"}]
[{"$nulls":3},"Ульяновская область",{"v":12.841042966846164,"d":"13"},{"v":377393.2275911883,"d":"377,393.23"}]
[{"$nulls":3},"Курганская область",{"v":12.66409434383845,"d":"13"},{"v":316188.6612968974,"d":"316,188.66"}]
[{"$nulls":3},"Свердловская область",{"v":13.405590445424334,"d":"13"},{"v":663703.2695869369,"d":"663,703.27"}]
[{"$nulls":3},"Тюменская область ",{"v":14.924551346247728,"d":"15"},{"v":3031449.1978023443,"d":"3,031,449.20"}]
[{"$nulls":3},"Челябинская область",{"v":13.111599221226971,"d":"13"},{"v":494646.78502070473,"d":"494,646.79"}]
[{"$nulls":3},"Республика Алтай",{"v":12.637373645664212,"d":"13"},{"v":307851.7594677848,"d":"307,851.76"}]
[{"$nulls":3},"Республика Тыва",{"v":12.59103866002377,"d":"13"},{"v":293912.87534058286,"d":"293,912.88"}]
[{"$nulls":3},"Республика Хакасия",{"v":13.222049656110825,"d":"13"},{"v":552412.1284030201,"d":"552,412.13"}]
[{"$nulls":3},"Алтайский край",{"v":12.637907951660479,"d":"13"},{"v":308016.29045986355,"d":"308,016.29"}]
[{"$nulls":3},"Красноярский край  ",{"$f":"LN(F99)","v":{"v":14.013821462010773,"d":"14"}},{"v":1219341.4330817775,"d":"1,219,341.43"}]
[{"$nulls":3},"Иркутская область",{"v":13.586960602641557,"d":"14"},{"v":795686.5474333778,"d":"795,686.55"}]
[{"$nulls":3},"Кемеровская область",{"v":13.108515808183164,"d":"13"},{"v":493123.93366809114,"d":"493,123.93"}]
[{"$nulls":3},"Новосибирская область",{"v":13.305104678016686,"d":"13"},{"v":600251.8991538995,"d":"600,251.90"}]
[{"$nulls":3},"Омская область",{"v":13.007162660813343,"d":"13"},{"v":445593.62494360266,"d":"445,593.62"}]
[{"$nulls":3},"Томская область",{"v":13.386331130848742,"d":"13"},{"v":651043.1039143126,"d":"651,043.10"}]
[{"$nulls":3},"Республика Бурятия",{"v":12.752627460964105,"d":"13"},{"v":345458.3831531595,"d":"345,458.38"}]
[{"$nulls":3},"Республика Саха (Якутия)",{"v":14.253613380026396,"d":"14"},{"v":1549764.2491833472,"d":"1,549,764.25"}]
[{"$nulls":3},"Забайкальский край",{"v":12.93509795840011,"d":"13"},{"v":414611.80773413327,"d":"414,611.81"}]
[{"$nulls":3},"Камчатский край",{"v":13.853777806534872,"d":"14"},{"v":1039008.8694130504,"d":"1,039,008.87"}]
[{"$nulls":3},"Приморский край",{"v":13.391363648094536,"d":"13"},{"v":654327.7476433233,"d":"654,327.75"}]
[{"$nulls":3},"Хабаровский край",{"v":13.44578642674413,"d":"13"},{"v":690924.9089604483,"d":"690,924.91"}]
[{"$nulls":3},"Амурская область",{"v":13.39856179038281,"d":"13"},{"v":659054.6840446163,"d":"659,054.68"}]
[{"$nulls":3},"Магаданская область",{"v":14.479855138144773,"d":"14"},{"v":1943216.481271477,"d":"1,943,216.48"}]
[{"$nulls":3},"Сахалинская область",{"v":15.026787619693035,"d":"15"},{"v":3357769.995197921,"d":"3,357,770.00"}]
[{"$nulls":3},"Еврейская автономная область",{"v":12.911546964962907,"d":"13"},{"v":404961.372486261,"d":"404,961.37"}]
[{"$nulls":3},"Чукотский автономный округ",{"v":14.641950599808435,"d":"15"},{"v":2285169.136242356,"d":"2,285,169.14"}]

{"sheet":"Table 0 (2)","index":2,"n_rows":33,"n_cols":5,"rows_kept":33,"hidden":true}
["Название","Доходность",null,"Срок до погашения ( лет )","Доходность"]
["Россия недельные",18890,null,0.02,{"v":0.0825,"d":"8.25%"}]
["Россия 2-недельные",19190,null,0.04,{"v":0.0832,"d":"8.32%"}]
["Россия 1-месячные",20300,null,0.08,{"v":0.0836,"d":"8.36%"}]
["Россия 2-месячные",21430,null,0.17,{"v":0.0843,"d":"8.43%"}]
["Россия 3-месячные",22310,null,0.25,{"v":0.0849,"d":"8.49%"}]
["Россия 6-месячные",23420,null,0.5,{"v":0.0884,"d":"8.84%"}]
["Россия годовые",24040,null,1,{"v":0.092,"d":"9.20%"}]
["Россия 2-летние",23585,null,2,{"v":0.0984,"d":"9.84%"}]
["Россия 3-летние",23075,null,3,{"v":0.1025,"d":"10.25%"}]
["Россия 5-летние",21805,null,5,{"v":0.1056,"d":"10.56%"}]
["Россия 7-летние",19915,null,7,{"v":0.1082,"d":"10.82%"}]
["Россия 10-летние",19530,null,10,{"v":0.1097,"d":"10.97%"}]
["Россия 15-летние",19315,null,15,{"v":0.1113,"d":"11.13%"}]
["Россия 20-летние",18420,null,20,{"v":0.1117,"d":"11.17%"}]
[]
[]
[]
["Название","Доходность",null,"инфа для сверки от 15 марта"]
["Россия недельные",18890]
["Россия 2-недельные",19190]
["Россия 1-месячные",20300]
["Россия 2-месячные",21430]
["Россия 3-месячные",22310]
["Россия 6-месячные",23420]
["Россия годовые",24040]
["Россия 2-летние",23585]
["Россия 3-летние",23075]
["Россия 5-летние",21805]
["Россия 7-летние",19915]
["Россия 10-летние",19530]
["Россия 15-летние",19315]
["Россия 20-летние",18420]